Reaction Details
TargetVascular endothelial growth factor receptor 2
LigandBDBM50431028
Substrate/Competitorn/a
Meas. Tech.ChEMBL_947329 (CHEMBL2344113)
IC50 1300±n/a nM
Citation Brown, AShi, QMoore, TWYoon, YPrussia, AMaddox, CLiotta, DCShim, HSnyder, JP Monocarbonyl curcumin analogues: heterocyclic pleiotropic kinase inhibitors that mediate anticancer properties. J Med Chem56:3456-66 (2013) 
 
Vascular endothelial growth factor receptor 2
Name:Vascular endothelial growth factor receptor 2
Type:Receptor Tyrosine Kinase
Mol. Mass.:151510.97
Organism:Homo sapiens (Human)
Description:P35968
Residue:1356
BDBM50431028
NameBDBM50431028
Synonyms:CHEMBL2338333
TypeSmall organic molecule
Emp. Form.C18H17N3O
Mol. Mass.291.3471
SMILESCN1C\C(=C/c2ccccn2)C(=O)\C(C1)=C\c1ccccn1