Reaction Details
TargetVascular endothelial growth factor receptor 2
LigandBDBM50431030
Substrate/Competitorn/a
Meas. Tech.ChEMBL_947329 (CHEMBL2344113)
IC50 770±n/a nM
Citation Brown, AShi, QMoore, TWYoon, YPrussia, AMaddox, CLiotta, DCShim, HSnyder, JP Monocarbonyl curcumin analogues: heterocyclic pleiotropic kinase inhibitors that mediate anticancer properties. J Med Chem56:3456-66 (2013) 
 
Vascular endothelial growth factor receptor 2
Name:Vascular endothelial growth factor receptor 2
Type:Receptor Tyrosine Kinase
Mol. Mass.:151510.97
Organism:Homo sapiens (Human)
Description:P35968
Residue:1356
BDBM50431030
NameBDBM50431030
Synonyms:CHEMBL379849
TypeSmall organic molecule
Emp. Form.C19H15F2NO
Mol. Mass.311.3253
SMILESFc1ccccc1\C=C1/CNC\C(=C/c2ccccc2F)C1=O