Reaction Details
TargetRho-associated protein kinase 1
LigandBDBM50431137
Substrate/Competitorn/a
Meas. Tech.ChEMBL_948342 (CHEMBL2341176)
IC50 4.0±n/a nM
Citation Yin, YLin, LRuiz, CKhan, SCameron, MDGrant, WPocas, JEid, NPark, HSchröter, TLograsso, PVFeng, Y Synthesis and biological evaluation of urea derivatives as highly potent and selective rho kinase inhibitors. J Med Chem56:3568-81 (2013) 
 
Rho-associated protein kinase 1
Name:Rho-associated protein kinase 1
Type:Serine/threonine-protein kinase
Mol. Mass.:158156.77
Organism:Homo sapiens (Human)
Description:Q13464
Residue:1354
BDBM50431137
NameBDBM50431137
Synonyms:CHEMBL2332060
TypeSmall organic molecule
Emp. Form.C25H31N5O3
Mol. Mass.449.5453
SMILESCCN(Cc1cccc(OC)c1)C(=O)Nc1ccc(cc1O[C@H]1CCN(C)C1)-c1cn[nH]c1