Reaction Details
TargetRho-associated protein kinase 2
LigandBDBM50431139
Substrate/Competitorn/a
Meas. Tech.ChEMBL_948348 (CHEMBL2341182)
IC50 4.0±n/a nM
Citation Yin, YLin, LRuiz, CKhan, SCameron, MDGrant, WPocas, JEid, NPark, HSchröter, TLograsso, PVFeng, Y Synthesis and biological evaluation of urea derivatives as highly potent and selective rho kinase inhibitors. J Med Chem56:3568-81 (2013) 
 
Rho-associated protein kinase 2
Name:Rho-associated protein kinase 2
Type:Protein
Mol. Mass.:160885.43
Organism:Homo sapiens (Human)
Description:O75116
Residue:1388
BDBM50431139
NameBDBM50431139
Synonyms:CHEMBL2332074
TypeSmall organic molecule
Emp. Form.C26H33N5O2
Mol. Mass.447.5725
SMILESCOc1cccc(CN(CCCN2CCCCC2)C(=O)Nc2ccc(cc2)-c2cn[nH]c2)c1