Reaction Details
TargetCytochrome P450 2C9
LigandBDBM50431135
Substrate/Competitorn/a
Meas. Tech.ChEMBL_948336 (CHEMBL2341170)
IC50 2000±n/a nM
Citation Yin, YLin, LRuiz, CKhan, SCameron, MDGrant, WPocas, JEid, NPark, HSchröter, TLograsso, PVFeng, Y Synthesis and biological evaluation of urea derivatives as highly potent and selective rho kinase inhibitors. J Med Chem56:3568-81 (2013) 
 
Cytochrome P450 2C9
Name:Cytochrome P450 2C9
Type:Enzyme
Mol. Mass.:55636.33
Organism:Homo sapiens (Human)
Description:P11712
Residue:490
BDBM50431135
NameBDBM50431135
Synonyms:CHEMBL2332065
TypeSmall organic molecule
Emp. Form.C20H22N4O3
Mol. Mass.366.4137
SMILESCOc1cccc(CN(CCO)C(=O)Nc2ccc(cc2)-c2cn[nH]c2)c1