Reaction Details
TargetMitogen-activated protein kinase 10
LigandBDBM50431131
Substrate/Competitorn/a
Meas. Tech.ChEMBL_948344 (CHEMBL2341178)
IC50>20000±n/a nM
Citation Yin, YLin, LRuiz, CKhan, SCameron, MDGrant, WPocas, JEid, NPark, HSchröter, TLograsso, PVFeng, Y Synthesis and biological evaluation of urea derivatives as highly potent and selective rho kinase inhibitors. J Med Chem56:3568-81 (2013) 
 
Mitogen-activated protein kinase 10
Name:Mitogen-activated protein kinase 10
Type:Enzyme
Mol. Mass.:52586.89
Organism:Homo sapiens (Human)
Description:n/a
Residue:464
BDBM50431131
NameBDBM50431131
Synonyms:CHEMBL2332056
TypeSmall organic molecule
Emp. Form.C19H19FN4O2
Mol. Mass.354.3782
SMILESOCCC(NC(=O)Nc1ccc(cc1)-c1cn[nH]c1)c1cccc(F)c1