Reaction Details
TargetRho-associated protein kinase 2
LigandBDBM50431152
Substrate/Competitorn/a
Meas. Tech.ChEMBL_948348 (CHEMBL2341182)
IC50 751±n/a nM
Citation Yin, YLin, LRuiz, CKhan, SCameron, MDGrant, WPocas, JEid, NPark, HSchröter, TLograsso, PVFeng, Y Synthesis and biological evaluation of urea derivatives as highly potent and selective rho kinase inhibitors. J Med Chem56:3568-81 (2013) 
 
Rho-associated protein kinase 2
Name:Rho-associated protein kinase 2
Type:Protein
Mol. Mass.:160885.43
Organism:Homo sapiens (Human)
Description:O75116
Residue:1388
BDBM50431152
NameBDBM50431152
Synonyms:CHEMBL2332084
TypeSmall organic molecule
Emp. Form.C17H22N4O
Mol. Mass.298.3828
SMILESO=C(NCC1CCCCC1)Nc1ccc(cc1)-c1cn[nH]c1