Reaction Details
TargetPoly [ADP-ribose] polymerase 1
LigandBDBM50431165
Substrate/Competitorn/a
Meas. Tech.ChEMBL_948351 (CHEMBL2341185)
IC50 2400±n/a nM
Citation Narwal, MHaikarainen, TFallarero, AVuorela, PMLehtiö, L Screening and structural analysis of flavones inhibiting tankyrases. J Med Chem56:3507-17 (2013) 
 
Poly [ADP-ribose] polymerase 1
Name:Poly [ADP-ribose] polymerase 1
Type:n/a
Mol. Mass.:113114.22
Organism:Homo sapiens (Human)
Description:P09874
Residue:1014
BDBM50431165
NameBDBM50431165
Synonyms:2-(3-hydroxyphenyl)-4H-chromen-4-one (2) NSC-22356
TypeSmall organic molecule
Emp. Form.C15H10O3
Mol. Mass.238.2381
SMILESOc1cccc(c1)-c1cc(=O)c2ccccc2o1