Reaction Details
TargetPoly [ADP-ribose] polymerase 1
LigandBDBM26659
Substrate/Competitorn/a
Meas. Tech.ChEMBL_948351 (CHEMBL2341185)
IC50 9500±n/a nM
Citation Narwal, MHaikarainen, TFallarero, AVuorela, PMLehtiö, L Screening and structural analysis of flavones inhibiting tankyrases. J Med Chem56:3507-17 (2013) 
 
Poly [ADP-ribose] polymerase 1
Name:Poly [ADP-ribose] polymerase 1
Type:n/a
Mol. Mass.:113114.22
Organism:Homo sapiens (Human)
Description:P09874
Residue:1014
BDBM26659
NameBDBM26659
Synonyms:7,3-dihydroxyflavone | 7-hydroxy-2-(3-hydroxyphenyl)-4H-chromen-4-one
TypeFlavonoid
Emp. Form.C15H10O4
Mol. Mass.254.2375
SMILESOc1cccc(c1)-c1cc(=O)c2ccc(O)cc2o1