Reaction Details
TargetPoly [ADP-ribose] polymerase tankyrase-1
LigandBDBM50028962
Substrate/Competitorn/a
Meas. Tech.ChEMBL_948354 (CHEMBL2341188)
IC50 320±n/a nM
Citation Narwal, MHaikarainen, TFallarero, AVuorela, PMLehtiö, L Screening and structural analysis of flavones inhibiting tankyrases. J Med Chem56:3507-17 (2013) 
 
Poly [ADP-ribose] polymerase tankyrase-1
Name:Poly [ADP-ribose] polymerase tankyrase-1
Type:Enzyme
Mol. Mass.:142058.03
Organism:Homo sapiens (Human)
Description:O95271
Residue:1327
BDBM50028962
NameBDBM50028962
Synonyms:CHEMBL275638 | flavone
TypeSmall organic molecule
Emp. Form.C15H10O2
Mol. Mass.222.2387
SMILESO=c1cc(oc2ccccc12)-c1ccccc1