Reaction Details
TargetPlasminogen
LigandBDBM50431220
Substrate/Competitorn/a
Meas. Tech.ChEMBL_948828 (CHEMBL2340210)
Ki 8300±n/a nM
Citation Baeriswyl, VCalzavarini, SGerschheimer, CDiderich, PAngelillo-Scherrer, AHeinis, C Development of a selective peptide macrocycle inhibitor of coagulation factor XII toward the generation of a safe antithrombotic therapy. J Med Chem56:3742-6 (2013) 
 
Plasminogen
Name:Plasminogen
Type:Enzyme
Mol. Mass.:90579.18
Organism:Homo sapiens (Human)
Description:n/a
Residue:810
BDBM50431220
NameBDBM50431220
Synonyms:CHEMBL2332610
TypeSmall organic molecule
Emp. Form.C64H93N17O16S3
Mol. Mass.1452.723
SMILESC[C@@H]1NC(=O)[C@@H]2CCCN2C(=O)[C@@H]2CCCN2C(=O)[C@@H]2CSCc3cc(CSC[C@H](NC(=O)[C@@H](N)CO)C(=O)NCC(=O)NCC(=O)N[C@@H](CCCNC(N)=N)C(=O)N4CCC[C@H]4C(=O)N2)cc(CSC[C@H](NC(=O)[C@H](Cc2ccc(O)cc2)NC1=O)C(=O)N[C@@H](CCCCN)C(O)=O)c3