Reaction Details
TargetProthrombin
LigandBDBM50431220
Substrate/Competitorn/a
Meas. Tech.ChEMBL_948829 (CHEMBL2340211)
Ki>120000±n/a nM
Citation Baeriswyl, VCalzavarini, SGerschheimer, CDiderich, PAngelillo-Scherrer, AHeinis, C Development of a selective peptide macrocycle inhibitor of coagulation factor XII toward the generation of a safe antithrombotic therapy. J Med Chem56:3742-6 (2013) 
 
Prothrombin
Name:Prothrombin
Type:Protein
Mol. Mass.:70029.57
Organism:Homo sapiens (Human)
Description:P00734
Residue:622
BDBM50431220
NameBDBM50431220
Synonyms:CHEMBL2332610
TypeSmall organic molecule
Emp. Form.C64H93N17O16S3
Mol. Mass.1452.723
SMILESC[C@@H]1NC(=O)[C@@H]2CCCN2C(=O)[C@@H]2CCCN2C(=O)[C@@H]2CSCc3cc(CSC[C@H](NC(=O)[C@@H](N)CO)C(=O)NCC(=O)NCC(=O)N[C@@H](CCCNC(N)=N)C(=O)N4CCC[C@H]4C(=O)N2)cc(CSC[C@H](NC(=O)[C@H](Cc2ccc(O)cc2)NC1=O)C(=O)N[C@@H](CCCCN)C(O)=O)c3