Reaction Details
TargetHepatocyte growth factor receptor
LigandBDBM50431278
Substrate/Competitorn/a
Meas. Tech.ChEMBL_950788 (CHEMBL2353694)
Kd 150±n/a nM
Citation Suárez, RMChevot, FCavagnino, ASaettel, NRadvanyi, FPiguel, SBernard-Pierrot, IStoven, VLegraverend, M Inhibitors of the TAM subfamily of tyrosine kinases: synthesis and biological evaluation. Eur J Med Chem61:2-25 (2013) 
 
Hepatocyte growth factor receptor
Name:Hepatocyte growth factor receptor
Type:Protein
Mol. Mass.:155559.73
Organism:Homo sapiens (Human)
Description:P08581
Residue:1390
BDBM50431278
NameBDBM50431278
Synonyms:CHEMBL2348264
TypeSmall organic molecule
Emp. Form.C24H14F4N6O3
Mol. Mass.510.4
SMILESFc1cc(NC(=O)c2cccn(-c3ccc(cc3)C(F)(F)F)c2=O)ccc1Oc1ncnc2nc[nH]c12