Reaction Details
TargetTyrosine-protein kinase receptor UFO
LigandBDBM50431281
Substrate/Competitorn/a
Meas. Tech.ChEMBL_951052 (CHEMBL2352090)
IC50 27±n/a nM
Citation Suárez, RMChevot, FCavagnino, ASaettel, NRadvanyi, FPiguel, SBernard-Pierrot, IStoven, VLegraverend, M Inhibitors of the TAM subfamily of tyrosine kinases: synthesis and biological evaluation. Eur J Med Chem61:2-25 (2013) 
 
Tyrosine-protein kinase receptor UFO
Name:Tyrosine-protein kinase receptor UFO
Type:Enzyme
Mol. Mass.:98316.97
Organism:Homo sapiens (Human)
Description:P30530
Residue:894
BDBM50431281
NameBDBM50431281
Synonyms:CHEMBL2347987
TypeSmall organic molecule
Emp. Form.C25H31ClN6OS
Mol. Mass.499.071
SMILESCC(C)S(=O)c1ccccc1Nc1nc(Nc2ccc(CN3CCN(C)CC3)cc2)ncc1Cl