Reaction Details
TargetTyrosine-protein kinase Yes
LigandBDBM50430297
Substrate/Competitorn/a
Meas. Tech.ChEMBL_951382 (CHEMBL2349756)
IC50>10000±n/a nM
Citation Iwatani, MIwata, HOkabe, ASkene, RJTomita, NHayashi, YAramaki, YHosfield, DJHori, ABaba, AMiki, H Discovery and characterization of novel allosteric FAK inhibitors. Eur J Med Chem61:49-60 (2013) 
 
Tyrosine-protein kinase Yes
Name:Tyrosine-protein kinase Yes
Type:Protein
Mol. Mass.:60801.54
Organism:Homo sapiens (Human)
Description:P07947
Residue:543
BDBM50430297
NameBDBM50430297
Synonyms:CHEMBL2333436
TypeSmall organic molecule
Emp. Form.C20H21N3O2S
Mol. Mass.367.465
SMILESCCc1ccc(cc1)-c1ccc2N(C)S(=O)(=O)c3cnn(CC)c3-c2c1