Reaction Details
TargetMitogen-activated protein kinase kinase kinase kinase 4
LigandBDBM50430297
Substrate/Competitorn/a
Meas. Tech.ChEMBL_951385 (CHEMBL2349759)
IC50>10000±n/a nM
Citation Iwatani, MIwata, HOkabe, ASkene, RJTomita, NHayashi, YAramaki, YHosfield, DJHori, ABaba, AMiki, H Discovery and characterization of novel allosteric FAK inhibitors. Eur J Med Chem61:49-60 (2013) 
 
Mitogen-activated protein kinase kinase kinase kinase 4
Name:Mitogen-activated protein kinase kinase kinase kinase 4
Type:Serine/threonine-protein kinase
Mol. Mass.:142114.73
Organism:Homo sapiens (Human)
Description:O95819
Residue:1239
BDBM50430297
NameBDBM50430297
Synonyms:CHEMBL2333436
TypeSmall organic molecule
Emp. Form.C20H21N3O2S
Mol. Mass.367.465
SMILESCCc1ccc(cc1)-c1ccc2N(C)S(=O)(=O)c3cnn(CC)c3-c2c1