Reaction Details
TargetFocal adhesion kinase 1
LigandBDBM50430289
Substrate/Competitorn/a
Meas. Tech.ChEMBL_952666 (CHEMBL2350124)
IC50 16300±n/a nM
Citation Iwatani, MIwata, HOkabe, ASkene, RJTomita, NHayashi, YAramaki, YHosfield, DJHori, ABaba, AMiki, H Discovery and characterization of novel allosteric FAK inhibitors. Eur J Med Chem61:49-60 (2013) 
 
Focal adhesion kinase 1
Name:Focal adhesion kinase 1
Type:Tyrosine-protein kinase
Mol. Mass.:119233.17
Organism:Homo sapiens (Human)
Description:Q05397
Residue:1052
BDBM50430289
NameBDBM50430289
Synonyms:CHEMBL2333445
TypeSmall organic molecule
Emp. Form.C18H17N3O2S
Mol. Mass.339.411
SMILESCCc1ccc(cc1)-c1ccc2N(C)S(=O)(=O)c3c[nH]nc3-c2c1