Reaction Details
TargetCannabinoid receptor 2
LigandBDBM50431423
Substrate/Competitorn/a
Meas. Tech.ChEMBL_952418 (CHEMBL2352784)
Ki>5000±n/a nM
Citation Kusakabe, KTada, YIso, YSakagami, MMorioka, YChomei, NShinonome, SKawamoto, KTakenaka, HYasui, KHamana, HHanasaki, K Design, synthesis, and binding mode prediction of 2-pyridone-based selective CB2 receptor agonists. Bioorg Med Chem21:2045-55 (2013) 
 
Cannabinoid receptor 2
Name:Cannabinoid receptor 2
Type:G Protein-Coupled Receptor (GPCR)
Mol. Mass.:39690.94
Organism:Homo sapiens (Human)
Description:P34972
Residue:360
BDBM50431423
NameBDBM50431423
Synonyms:CHEMBL2348061
TypeSmall organic molecule
Emp. Form.C19H18N2O2S
Mol. Mass.338.423
SMILESCCN1C(C)c2ccccc2C(Sc2nc3ccccc3o2)C1=O