Reaction Details
TargetCannabinoid receptor 2
LigandBDBM50431424
Substrate/Competitorn/a
Meas. Tech.ChEMBL_952416 (CHEMBL2352782)
Ki 14±n/a nM
Citation Kusakabe, KTada, YIso, YSakagami, MMorioka, YChomei, NShinonome, SKawamoto, KTakenaka, HYasui, KHamana, HHanasaki, K Design, synthesis, and binding mode prediction of 2-pyridone-based selective CB2 receptor agonists. Bioorg Med Chem21:2045-55 (2013) 
 
Cannabinoid receptor 2
Name:Cannabinoid receptor 2
Type:G Protein-Coupled Receptor (GPCR)
Mol. Mass.:39690.94
Organism:Homo sapiens (Human)
Description:P34972
Residue:360
BDBM50431424
NameBDBM50431424
Synonyms:CHEMBL2348277
TypeSmall organic molecule
Emp. Form.C19H24N2O2
Mol. Mass.312.4061
SMILESCCCCn1c(C)c(C)cc(NC(=O)c2ccccc2C)c1=O