Reaction Details
TargetHeparanase
LigandBDBM50431641
Substrate/Competitorn/a
Meas. Tech.ChEMBL_950896 (CHEMBL2349720)
Kd>1000000±n/a nM
Citation Gozalbes, RMosulén, SOrtí, LRodríguez-Díaz, JCarbajo, RJMelnyk, PPineda-Lucena, A Hit identification of novel heparanase inhibitors by structure- and ligand-based approaches. Bioorg Med Chem21:1944-51 (2013) 
 
Heparanase
Name:Heparanase
Type:PROTEIN
Mol. Mass.:61167.67
Organism:Homo sapiens (Human)
Description:ChEMBL_327900
Residue:543
BDBM50431641
NameBDBM50431641
Synonyms:CHEMBL490277
TypeSmall organic molecule
Emp. Form.C27H30ClN5O3
Mol. Mass.508.012
SMILESClc1ccc2c(Nc3cc(NC(=O)CN4CCCCC4)cc(c3)C(=O)N3CCOCC3)ccnc2c1