Reaction Details
TargetHeparanase
LigandBDBM50431644
Substrate/Competitorn/a
Meas. Tech.ChEMBL_950896 (CHEMBL2349720)
Kd 1000000±n/a nM
Citation Gozalbes, RMosulén, SOrtí, LRodríguez-Díaz, JCarbajo, RJMelnyk, PPineda-Lucena, A Hit identification of novel heparanase inhibitors by structure- and ligand-based approaches. Bioorg Med Chem21:1944-51 (2013) 
 
Heparanase
Name:Heparanase
Type:PROTEIN
Mol. Mass.:61167.67
Organism:Homo sapiens (Human)
Description:ChEMBL_327900
Residue:543
BDBM50431644
NameBDBM50431644
Synonyms:CHEMBL94587
TypeSmall organic molecule
Emp. Form.C28H34ClN5O2
Mol. Mass.508.055
SMILESOC1CCN(Cc2cc(NC(=O)CN3CCCCC3)cc(Nc3ccnc4cc(Cl)ccc34)c2)CC1