Reaction Details
TargetHeparanase
LigandBDBM30704
Substrate/Competitorn/a
Meas. Tech.ChEMBL_950896 (CHEMBL2349720)
Kd>1000000±n/a nM
Citation Gozalbes, RMosulén, SOrtí, LRodríguez-Díaz, JCarbajo, RJMelnyk, PPineda-Lucena, A Hit identification of novel heparanase inhibitors by structure- and ligand-based approaches. Bioorg Med Chem21:1944-51 (2013) 
 
Heparanase
Name:Heparanase
Type:PROTEIN
Mol. Mass.:61167.67
Organism:Homo sapiens (Human)
Description:ChEMBL_327900
Residue:543
BDBM30704
NameBDBM30704
Synonyms:(phenylmethyl) N-[[(6aR,9S,10aR)-4,7-dimethyl-6,6a,8,9,10,10a-hexahydroindolo[4,3-fg]quinoline-9-yl]methyl]carbamate METERGOLINE N-[[(6aR,9S,10aR)-4,7-dimethyl-6,6a,8,9,10,10a-hexahydroindolo[4,3-fg]quinoline-9-yl]methyl]carbamic acid (phenylmethyl) ester SMR000059050 cid_28693
TypeSmall organic molecule
Emp. Form.C25H29N3O2
Mol. Mass.403.5167
SMILESCN1C[C@H](CNC(=O)OCc2ccccc2)C[C@H]2[C@H]1Cc1cn(C)c3cccc2c13