Reaction Details
TargetHeparanase
LigandBDBM50175813
Substrate/Competitorn/a
Meas. Tech.ChEMBL_950897 (CHEMBL2349721)
IC50 290±n/a nM
Citation Gozalbes, RMosulén, SOrtí, LRodríguez-Díaz, JCarbajo, RJMelnyk, PPineda-Lucena, A Hit identification of novel heparanase inhibitors by structure- and ligand-based approaches. Bioorg Med Chem21:1944-51 (2013) 
 
Heparanase
Name:Heparanase
Type:PROTEIN
Mol. Mass.:61167.67
Organism:Homo sapiens (Human)
Description:ChEMBL_327900
Residue:543
BDBM50175813
NameBDBM50175813
Synonyms:CHEMBL200831 | N-(4-{[5-(1H-benzoimidazol-2-yl)-pyridin-2-ylamino]methyl}-phenyl)-3-bromo-4-methoxy-benzamide
TypeSmall organic molecule
Emp. Form.C27H22BrN5O2
Mol. Mass.528.4
SMILESCOc1ccc(cc1Br)C(=O)Nc1ccc(CNc2ccc(cn2)-c2nc3ccccc3[nH]2)cc1