Reaction Details
TargetMu-type opioid receptor
LigandBDBM50431841
Substrate/Competitorn/a
Meas. Tech.ChEMBL_952454 (CHEMBL2353047)
Ki 0.820000±n/a nM
Citation VanAlstine, MAWentland, MPAlvarez, JCao, QCohen, DJKnapp, BIBidlack, JM Redefining the structure-activity relationships of 2,6-methano-3-benzazocines. Part 9: Synthesis, characterization and molecular modeling of pyridinyl isosteres of N-BPE-8-CAC (1), a high affinity ligand for opioid receptors. Bioorg Med Chem Lett23:2128-33 (2013) 
 
Mu-type opioid receptor
Name:Mu-type opioid receptor
Type:G Protein-Coupled Receptor (GPCR)
Mol. Mass.:44789.51
Organism:Homo sapiens (Human)
Description:P35372
Residue:400
BDBM50431841
NameBDBM50431841
Synonyms:CHEMBL2347239
TypeSmall organic molecule
Emp. Form.C32H37N3O
Mol. Mass.479.6557
SMILESC[C@H]1C2Cc3ccc(cc3[C@@]1(C)CCN2CC1CC1)C(=O)NCCc1ccc(cn1)-c1ccccc1