Reaction Details
TargetDelta-type opioid receptor
LigandBDBM50431839
Substrate/Competitorn/a
Meas. Tech.ChEMBL_952455 (CHEMBL2353048)
Ki 8.2±n/a nM
Citation VanAlstine, MAWentland, MPAlvarez, JCao, QCohen, DJKnapp, BIBidlack, JM Redefining the structure-activity relationships of 2,6-methano-3-benzazocines. Part 9: Synthesis, characterization and molecular modeling of pyridinyl isosteres of N-BPE-8-CAC (1), a high affinity ligand for opioid receptors. Bioorg Med Chem Lett23:2128-33 (2013) 
 
Delta-type opioid receptor
Name:Delta-type opioid receptor
Type:G Protein-Coupled Receptor (GPCR)
Mol. Mass.:40382.98
Organism:Homo sapiens (Human)
Description:Competition binding assays were carried out using membrane preparations from transfected HN9.10 cells that constitutively expressed the delta opioid receptor.
Residue:372
BDBM50431839
NameBDBM50431839
Synonyms:CHEMBL2347236
TypeSmall organic molecule
Emp. Form.C32H37N3O
Mol. Mass.479.6557
SMILESC[C@H]1C2Cc3ccc(cc3[C@@]1(C)CCN2CC1CC1)C(=O)NCCc1ccc(cc1)-c1cccnc1