Reaction Details
TargetKinesin-like protein KIF11
LigandBDBM50431891
Substrate/Competitorn/a
Meas. Tech.ChEMBL_953359 (CHEMBL2350446)
IC50 1.2±n/a nM
Citation El-Nassan, HB Advances in the discovery of kinesin spindle protein (Eg5) inhibitors as antitumor agents. Eur J Med Chem62:614-31 (2013) 
 
Kinesin-like protein KIF11
Name:Kinesin-like protein KIF11
Type:PROTEIN
Mol. Mass.:119138.97
Organism:Homo sapiens (Human)
Description:ChEMBL_1457426
Residue:1056
BDBM50431891
NameBDBM50431891
Synonyms:CHEMBL2347651
TypeSmall organic molecule
Emp. Form.C30H33ClN4O2
Mol. Mass.517.062
SMILESCC(C)[C@@H](N(CCCN)C(=O)c1ccc(C)cc1)c1nc2cc(Cl)ccc2c(=O)n1Cc1ccccc1