Reaction Details
TargetEnoyl-acyl carrier reductase ENR
LigandBDBM50431918
Substrate/Competitorn/a
Meas. Tech.ChEMBL_953658 (CHEMBL2352562)
IC50 135±n/a nM
Citation Cheng, GMuench, SPZhou, YAfanador, GAMui, EJFomovska, ALai, BSPrigge, STWoods, SRoberts, CWHickman, MRLee, PJLeed, SEAuschwitz, JMRice, DWMcLeod, R Design, synthesis, and biological activity of diaryl ether inhibitors of Toxoplasma gondii enoyl reductase. Bioorg Med Chem Lett23:2035-43 (2013) 
 
Enoyl-acyl carrier reductase ENR
Name:Enoyl-acyl carrier reductase ENR
Type:PROTEIN
Mol. Mass.:43663.67
Organism:Toxoplasma gondii
Description:ChEMBL_1290812
Residue:417
BDBM50431918
NameBDBM50431918
Synonyms:CHEMBL2347828
TypeSmall organic molecule
Emp. Form.C15H10ClNO2
Mol. Mass.271.698
SMILESOc1cc(Cl)ccc1Oc1ccc2ncccc2c1