Reaction Details
TargetExtracellular calcium-sensing receptor
LigandBDBM50432119
Substrate/Competitorn/a
Meas. Tech.ChEMBL_950625 (CHEMBL2352375)
EC50 60±n/a nM
Citation Temal, TJary, HAuberval, MLively, SGuédin, DVevert, JPDeprez, P New potent calcimimetics: I. Discovery of a series of novel trisubstituted ureas. Bioorg Med Chem Lett23:2451-4 (2013) 
 
Extracellular calcium-sensing receptor
Name:Extracellular calcium-sensing receptor
Type:Protein
Mol. Mass.:120663.13
Organism:Homo sapiens (Human)
Description:P41180
Residue:1078
BDBM50432119
NameBDBM50432119
Synonyms:CHEMBL2349603
TypeSmall organic molecule
Emp. Form.C31H34N4O3
Mol. Mass.510.6267
SMILESO=C(Nc1cccc(c1)-c1cnco1)N(CCC(c1ccccc1)c1ccccc1)CCN1CCOCC1