Reaction Details
TargetExtracellular calcium-sensing receptor
LigandBDBM50432122
Substrate/Competitorn/a
Meas. Tech.ChEMBL_950625 (CHEMBL2352375)
EC50 200±n/a nM
Citation Temal, TJary, HAuberval, MLively, SGuédin, DVevert, JPDeprez, P New potent calcimimetics: I. Discovery of a series of novel trisubstituted ureas. Bioorg Med Chem Lett23:2451-4 (2013) 
 
Extracellular calcium-sensing receptor
Name:Extracellular calcium-sensing receptor
Type:Protein
Mol. Mass.:120663.13
Organism:Homo sapiens (Human)
Description:P41180
Residue:1078
BDBM50432122
NameBDBM50432122
Synonyms:CHEMBL2349600
TypeSmall organic molecule
Emp. Form.C34H37N3O2
Mol. Mass.519.6765
SMILESO=C(Nc1cccc(c1)-c1ccccc1)N(CCC(c1ccccc1)c1ccccc1)CCN1CCOCC1