Reaction Details
TargetExtracellular calcium-sensing receptor
LigandBDBM50432134
Substrate/Competitorn/a
Meas. Tech.ChEMBL_950625 (CHEMBL2352375)
EC50 800±n/a nM
Citation Temal, TJary, HAuberval, MLively, SGuédin, DVevert, JPDeprez, P New potent calcimimetics: I. Discovery of a series of novel trisubstituted ureas. Bioorg Med Chem Lett23:2451-4 (2013) 
 
Extracellular calcium-sensing receptor
Name:Extracellular calcium-sensing receptor
Type:Protein
Mol. Mass.:120663.13
Organism:Homo sapiens (Human)
Description:P41180
Residue:1078
BDBM50432134
NameBDBM50432134
Synonyms:CHEMBL2349588
TypeSmall organic molecule
Emp. Form.C29H35N3O3
Mol. Mass.473.6065
SMILESOCc1cccc(NC(=O)N(CCC(c2ccccc2)c2ccccc2)CCN2CCOCC2)c1