Reaction Details
TargetExtracellular calcium-sensing receptor
LigandBDBM50432144
Substrate/Competitorn/a
Meas. Tech.ChEMBL_950625 (CHEMBL2352375)
EC50 400±n/a nM
Citation Temal, TJary, HAuberval, MLively, SGuédin, DVevert, JPDeprez, P New potent calcimimetics: I. Discovery of a series of novel trisubstituted ureas. Bioorg Med Chem Lett23:2451-4 (2013) 
 
Extracellular calcium-sensing receptor
Name:Extracellular calcium-sensing receptor
Type:Protein
Mol. Mass.:120663.13
Organism:Homo sapiens (Human)
Description:P41180
Residue:1078
BDBM50432144
NameBDBM50432144
Synonyms:CHEMBL2349578
TypeSmall organic molecule
Emp. Form.C33H40N4O5
Mol. Mass.572.6945
SMILESCOC(=O)N1CCN(CCCN(CCC(c2ccccc2)c2ccccc2)C(=O)Nc2cccc(c2)C(=O)OC)CC1