Reaction Details
TargetExtracellular calcium-sensing receptor
LigandBDBM50432156
Substrate/Competitorn/a
Meas. Tech.ChEMBL_950625 (CHEMBL2352375)
EC50 6000±n/a nM
Citation Temal, TJary, HAuberval, MLively, SGuédin, DVevert, JPDeprez, P New potent calcimimetics: I. Discovery of a series of novel trisubstituted ureas. Bioorg Med Chem Lett23:2451-4 (2013) 
 
Extracellular calcium-sensing receptor
Name:Extracellular calcium-sensing receptor
Type:Protein
Mol. Mass.:120663.13
Organism:Homo sapiens (Human)
Description:P41180
Residue:1078
BDBM50432156
NameBDBM50432156
Synonyms:CHEMBL2346666
TypeSmall organic molecule
Emp. Form.C24H26N2O
Mol. Mass.358.476
SMILESC[C@@H](NC(=O)NCCC(c1ccccc1)c1ccccc1)c1ccccc1