Reaction Details
TargetExtracellular calcium-sensing receptor
LigandBDBM50432161
Substrate/Competitorn/a
Meas. Tech.ChEMBL_950625 (CHEMBL2352375)
EC50 4000±n/a nM
Citation Temal, TJary, HAuberval, MLively, SGuédin, DVevert, JPDeprez, P New potent calcimimetics: I. Discovery of a series of novel trisubstituted ureas. Bioorg Med Chem Lett23:2451-4 (2013) 
 
Extracellular calcium-sensing receptor
Name:Extracellular calcium-sensing receptor
Type:Protein
Mol. Mass.:120663.13
Organism:Homo sapiens (Human)
Description:P41180
Residue:1078
BDBM50432161
NameBDBM50432161
Synonyms:CHEMBL2346774
TypeSmall organic molecule
Emp. Form.C28H26N2O
Mol. Mass.406.5188
SMILESO=C(NCCC(c1ccccc1)c1ccccc1)Nc1ccc(cc1)-c1ccccc1