Reaction Details
TargetExtracellular calcium-sensing receptor
LigandBDBM50299670
Substrate/Competitorn/a
Meas. Tech.ChEMBL_950625 (CHEMBL2352375)
EC50 80±n/a nM
Citation Temal, TJary, HAuberval, MLively, SGuédin, DVevert, JPDeprez, P New potent calcimimetics: I. Discovery of a series of novel trisubstituted ureas. Bioorg Med Chem Lett23:2451-4 (2013) 
 
Extracellular calcium-sensing receptor
Name:Extracellular calcium-sensing receptor
Type:Protein
Mol. Mass.:120663.13
Organism:Homo sapiens (Human)
Description:P41180
Residue:1078
BDBM50299670
NameBDBM50299670
Synonyms:(R)-3-(2-chlorophenyl)-N-(1-(3-methoxyphenyl)ethyl)propan-1-amine [3-(2-Chloro-phenyl)-propyl]-[(R)-1-(3-methoxy-phenyl)-ethyl]-amine
TypeSmall organic molecule
Emp. Form.C18H22ClNO
Mol. Mass.303.826
SMILESCOc1cccc(c1)[C@@H](C)NCCCc1ccccc1Cl