Reaction Details
TargetNuclear receptor subfamily 2 group C member 2
LigandBDBM50432373
Substrate/Competitorn/a
Meas. Tech.ChEMBL_952229 (CHEMBL2351288)
IC50>10000±n/a nM
Citation Kawakita, YSeto, MOhashi, TTamura, TYusa, TMiki, HIwata, HKamiguchi, HTanaka, TSogabe, SOhta, YIshikawa, T Design and synthesis of novel pyrimido[4,5-b]azepine derivatives as HER2/EGFR dual inhibitors. Bioorg Med Chem21:2250-61 (2013) 
 
Nuclear receptor subfamily 2 group C member 2
Name:Nuclear receptor subfamily 2 group C member 2
Type:PROTEIN
Mol. Mass.:65411.75
Organism:Homo sapiens (Human)
Description:ChEMBL_1476357
Residue:596
BDBM50432373
NameBDBM50432373
Synonyms:CHEMBL2348417
TypeSmall organic molecule
Emp. Form.C25H22ClN5O3S
Mol. Mass.507.992
SMILESOCCNC(=O)C1=Cc2c(Nc3ccc(Oc4cccc5sccc45)c(Cl)c3)ncnc2NCC1