Reaction Details
TargetEpidermal growth factor receptor
LigandBDBM50432374
Substrate/Competitorn/a
Meas. Tech.ChEMBL_952256 (CHEMBL2351562)
IC50 47±n/a nM
Citation Kawakita, YSeto, MOhashi, TTamura, TYusa, TMiki, HIwata, HKamiguchi, HTanaka, TSogabe, SOhta, YIshikawa, T Design and synthesis of novel pyrimido[4,5-b]azepine derivatives as HER2/EGFR dual inhibitors. Bioorg Med Chem21:2250-61 (2013) 
 
Epidermal growth factor receptor
Name:Epidermal growth factor receptor
Type:Receptor Kinase Domain
Mol. Mass.:134279.59
Organism:Homo sapiens (Human)
Description:P00533
Residue:1210
BDBM50432374
NameBDBM50432374
Synonyms:CHEMBL2348418
TypeSmall organic molecule
Emp. Form.C26H24ClN5O4S2
Mol. Mass.570.083
SMILESCS(=O)(=O)CCNC(=O)C1=Cc2c(Nc3ccc(Oc4cccc5sccc45)c(Cl)c3)ncnc2NCC1