Reaction Details
TargetEpidermal growth factor receptor
LigandBDBM50432378
Substrate/Competitorn/a
Meas. Tech.ChEMBL_952256 (CHEMBL2351562)
IC50 110±n/a nM
Citation Kawakita, YSeto, MOhashi, TTamura, TYusa, TMiki, HIwata, HKamiguchi, HTanaka, TSogabe, SOhta, YIshikawa, T Design and synthesis of novel pyrimido[4,5-b]azepine derivatives as HER2/EGFR dual inhibitors. Bioorg Med Chem21:2250-61 (2013) 
 
Epidermal growth factor receptor
Name:Epidermal growth factor receptor
Type:Receptor Kinase Domain
Mol. Mass.:134279.59
Organism:Homo sapiens (Human)
Description:P00533
Residue:1210
BDBM50432378
NameBDBM50432378
Synonyms:CHEMBL2348419
TypeSmall organic molecule
Emp. Form.C23H18ClF3N4O3
Mol. Mass.490.862
SMILESCOC(=O)C1=Cc2c(Nc3ccc(Oc4cccc(c4)C(F)(F)F)c(Cl)c3)ncnc2NCC1