Reaction Details
TargetReceptor tyrosine-protein kinase erbB-2
LigandBDBM50432375
Substrate/Competitorn/a
Meas. Tech.ChEMBL_952257 (CHEMBL2351563)
IC50 18±n/a nM
Citation Kawakita, YSeto, MOhashi, TTamura, TYusa, TMiki, HIwata, HKamiguchi, HTanaka, TSogabe, SOhta, YIshikawa, T Design and synthesis of novel pyrimido[4,5-b]azepine derivatives as HER2/EGFR dual inhibitors. Bioorg Med Chem21:2250-61 (2013) 
 
Receptor tyrosine-protein kinase erbB-2
Name:Receptor tyrosine-protein kinase erbB-2
Type:n/a
Mol. Mass.:137894.47
Organism:Homo sapiens (Human)
Description:P04626
Residue:1255
BDBM50432375
NameBDBM50432375
Synonyms:CHEMBL2348416
TypeSmall organic molecule
Emp. Form.C24H19ClN4O3S
Mol. Mass.478.951
SMILESCOC(=O)C1=Cc2c(Nc3ccc(Oc4cccc5sccc45)c(Cl)c3)ncnc2NCC1