Reaction Details
TargetCarbonic anhydrase 12
LigandBDBM50432380
Substrate/Competitorn/a
Meas. Tech.ChEMBL_952507 (CHEMBL2353329)
Ki 7.1±n/a nM
Citation Biswas, SCarta, FScozzafava, AMcKenna, RSupuran, CT Structural effect of phenyl ring compared to thiadiazole based adamantyl-sulfonamides on carbonic anhydrase inhibition. Bioorg Med Chem21:2314-8 (2013) 
 
Carbonic anhydrase 12
Name:Carbonic anhydrase 12
Type:Enzyme
Mol. Mass.:39456.00
Organism:Homo sapiens (Human)
Description:Catalytic domain of human cloned isozyme was used in the assay
Residue:354
BDBM50432380
NameBDBM50432380
Synonyms:CHEMBL2348439
TypeSmall organic molecule
Emp. Form.C17H22N2O3S
Mol. Mass.334.433
SMILESNS(=O)(=O)c1ccc(NC(=O)C23CC4CC(CC(C4)C2)C3)cc1