Reaction Details
TargetCarbonic anhydrase 9
LigandBDBM50432380
Substrate/Competitorn/a
Meas. Tech.ChEMBL_952508 (CHEMBL2353330)
Ki 51±n/a nM
Citation Biswas, SCarta, FScozzafava, AMcKenna, RSupuran, CT Structural effect of phenyl ring compared to thiadiazole based adamantyl-sulfonamides on carbonic anhydrase inhibition. Bioorg Med Chem21:2314-8 (2013) 
 
Carbonic anhydrase 9
Name:Carbonic anhydrase 9
Type:Enzyme
Mol. Mass.:49669.03
Organism:Homo sapiens (Human)
Description:Catalytic domain of human cloned isozyme was used in the assay
Residue:459
BDBM50432380
NameBDBM50432380
Synonyms:CHEMBL2348439
TypeSmall organic molecule
Emp. Form.C17H22N2O3S
Mol. Mass.334.433
SMILESNS(=O)(=O)c1ccc(NC(=O)C23CC4CC(CC(C4)C2)C3)cc1