Reaction Details
TargetCarbonic anhydrase 2
LigandBDBM50323341
Substrate/Competitorn/a
Meas. Tech.ChEMBL_952510 (CHEMBL2353332)
Ki 8.0±n/a nM
Citation Biswas, SCarta, FScozzafava, AMcKenna, RSupuran, CT Structural effect of phenyl ring compared to thiadiazole based adamantyl-sulfonamides on carbonic anhydrase inhibition. Bioorg Med Chem21:2314-8 (2013) 
 
Carbonic anhydrase 2
Name:Carbonic anhydrase 2
Type:Enzyme
Mol. Mass.:29250.71
Organism:Homo sapiens (Human)
Description:P00918
Residue:260
BDBM50323341
NameBDBM50323341
Synonyms:CHEMBL1209039
TypeSmall organic molecule
Emp. Form.C14H20N4O3S2
Mol. Mass.356.464
SMILESNS(=O)(=O)c1nnc(NC(=O)CC23CC4CC(CC(C4)C2)C3)s1