Reaction Details
TargetMitogen-activated protein kinase 10
LigandBDBM50430445
Substrate/Competitorn/a
Meas. Tech.ChEMBL_952816 (CHEMBL2351321)
Kd 743±n/a nM
Citation Kim, MHLee, JJung, KKim, MPark, YJAhn, HKwon, YHHah, JM Syntheses and biological evaluation of 1-heteroaryl-2-aryl-1H-benzimidazole derivatives as c-Jun N-terminal kinase inhibitors with neuroprotective effects. Bioorg Med Chem21:2271-85 (2013) 
 
Mitogen-activated protein kinase 10
Name:Mitogen-activated protein kinase 10
Type:Enzyme
Mol. Mass.:52586.89
Organism:Homo sapiens (Human)
Description:n/a
Residue:464
BDBM50430445
NameBDBM50430445
Synonyms:CHEMBL2334721
TypeSmall organic molecule
Emp. Form.C28H27N5O
Mol. Mass.449.5469
SMILESCOc1ccc2n(c(nc2c1)-c1ccc2ccccc2c1)-c1ccnc(NC2CCCCC2)n1