Reaction Details
TargetMitogen-activated protein kinase 10
LigandBDBM50430432
Substrate/Competitorn/a
Meas. Tech.ChEMBL_952811 (CHEMBL2351316)
IC50 1090±n/a nM
Citation Kim, MHLee, JJung, KKim, MPark, YJAhn, HKwon, YHHah, JM Syntheses and biological evaluation of 1-heteroaryl-2-aryl-1H-benzimidazole derivatives as c-Jun N-terminal kinase inhibitors with neuroprotective effects. Bioorg Med Chem21:2271-85 (2013) 
 
Mitogen-activated protein kinase 10
Name:Mitogen-activated protein kinase 10
Type:Enzyme
Mol. Mass.:52586.89
Organism:Homo sapiens (Human)
Description:n/a
Residue:464
BDBM50430432
NameBDBM50430432
Synonyms:CHEMBL2334705
TypeSmall organic molecule
Emp. Form.C30H28N6O2
Mol. Mass.504.5823
SMILESOc1ccc2nc(-c3ccc4ccccc4c3)n(-c3ccnc(N[C@@H]4CCCN(C4)C(=O)C4CC4)n3)c2c1