Reaction Details
TargetBeta-1 adrenergic receptor
LigandBDBM50432701
Substrate/Competitorn/a
Meas. Tech.ChEMBL_952276 (CHEMBL2351582)
EC50 3±n/a nM
Citation Mistry, SNBaker, JGFischer, PMHill, SJGardiner, SMKellam, B Synthesis and in vitro and in vivo characterization of highlyß1-selectiveß-adrenoceptor partial agonists. J Med Chem56:3852-65 (2013) 
 
Beta-1 adrenergic receptor
Name:Beta-1 adrenergic receptor
Type:G Protein-Coupled Receptor (GPCR)
Mol. Mass.:51338.40
Organism:Homo sapiens (Human)
Description:P08588
Residue:477
BDBM50432701
NameBDBM50432701
Synonyms:CHEMBL2348201
TypeSmall organic molecule
Emp. Form.C25H34ClN3O5
Mol. Mass.492.008
SMILESOC(CNCCNC(=O)Nc1cccc(Cl)c1)COc1ccc(OCCOC2CCCC2)cc1