Reaction Details
TargetBeta-3 adrenergic receptor
LigandBDBM50432707
Substrate/Competitorn/a
Meas. Tech.ChEMBL_952277 (CHEMBL2351583)
Kd>10000±n/a nM
Citation Mistry, SNBaker, JGFischer, PMHill, SJGardiner, SMKellam, B Synthesis and in vitro and in vivo characterization of highlyß1-selectiveß-adrenoceptor partial agonists. J Med Chem56:3852-65 (2013) 
 
Beta-3 adrenergic receptor
Name:Beta-3 adrenergic receptor
Type:G Protein-Coupled Receptor (GPCR)
Mol. Mass.:43534.88
Organism:Homo sapiens (Human)
Description:n/a
Residue:408
BDBM50432707
NameBDBM50432707
Synonyms:LK-204-545 | LK-204545
TypeSmall organic molecule
Emp. Form.C25H32N4O6
Mol. Mass.484.5448
SMILESOC(CNCCNC(=O)Nc1ccc(O)cc1)COc1ccc(OCCOCC2CC2)cc1C#N