Reaction Details
TargetBeta-3 adrenergic receptor
LigandBDBM50432702
Substrate/Competitorn/a
Meas. Tech.ChEMBL_952277 (CHEMBL2351583)
Kd>10000±n/a nM
Citation Mistry, SNBaker, JGFischer, PMHill, SJGardiner, SMKellam, B Synthesis and in vitro and in vivo characterization of highlyß1-selectiveß-adrenoceptor partial agonists. J Med Chem56:3852-65 (2013) 
 
Beta-3 adrenergic receptor
Name:Beta-3 adrenergic receptor
Type:G Protein-Coupled Receptor (GPCR)
Mol. Mass.:43534.88
Organism:Homo sapiens (Human)
Description:n/a
Residue:408
BDBM50432702
NameBDBM50432702
Synonyms:CHEMBL2348211
TypeSmall organic molecule
Emp. Form.C25H35N3O5
Mol. Mass.457.5625
SMILESOC(CNCCNC(=O)Nc1ccccc1)COc1ccc(OCCOC2CCCC2)cc1