Reaction Details
TargetCannabinoid receptor 1
LigandBDBM50169951
Substrate/Competitorn/a
Meas. Tech.ChEMBL_952575 (CHEMBL2354088)
EC50 1530±n/a nM
Citation Thakur, GABajaj, SParonis, CPeng, YBowman, ALBarak, LSCaron, MGParrish, DDeschamps, JRMakriyannis, A Novel adamantyl cannabinoids as CB1 receptor probes. J Med Chem56:3904-21 (2013) 
 
Cannabinoid receptor 1
Name:Cannabinoid receptor 1
Type:G Protein-Coupled Receptor (GPCR)
Mol. Mass.:52868.96
Organism:Homo sapiens (Human)
Description:P21554
Residue:472
BDBM50169951
NameBDBM50169951
Synonyms:(6aR,10aR)-3-Adamantan-1-yl-6,6,9-trimethyl-6a,7,10,10a-tetrahydro-6H-benzo[c]chromen-1-ol AM-411 | CHEMBL434351
TypeSmall organic molecule
Emp. Form.C26H34O2
Mol. Mass.378.547
SMILESCC1=CC[C@@H]2[C@@H](C1)c1c(O)cc(cc1OC2(C)C)C12CC3CC(CC(C3)C1)C2