Reaction Details
TargetCannabinoid receptor 2
LigandBDBM50432716
Substrate/Competitorn/a
Meas. Tech.ChEMBL_952581 (CHEMBL2354094)
Ki 338±n/a nM
Citation Thakur, GABajaj, SParonis, CPeng, YBowman, ALBarak, LSCaron, MGParrish, DDeschamps, JRMakriyannis, A Novel adamantyl cannabinoids as CB1 receptor probes. J Med Chem56:3904-21 (2013) 
 
Cannabinoid receptor 2
Name:Cannabinoid receptor 2
Type:G Protein-Coupled Receptor (GPCR)
Mol. Mass.:39690.94
Organism:Homo sapiens (Human)
Description:P34972
Residue:360
BDBM50432716
NameBDBM50432716
Synonyms:CHEMBL2348475
TypeSmall organic molecule
Emp. Form.C26H30O3
Mol. Mass.390.5146
SMILESCOc1ccc2c(c1)-c1c(O)cc(cc1OC2(C)C)C12CC3CC(CC(C3)C1)C2