Reaction Details
TargetCannabinoid receptor 2
LigandBDBM50432712
Substrate/Competitorn/a
Meas. Tech.ChEMBL_952584 (CHEMBL2354097)
Ki 32±n/a nM
Citation Thakur, GABajaj, SParonis, CPeng, YBowman, ALBarak, LSCaron, MGParrish, DDeschamps, JRMakriyannis, A Novel adamantyl cannabinoids as CB1 receptor probes. J Med Chem56:3904-21 (2013) 
 
Cannabinoid receptor 2
Name:Cannabinoid receptor 2
Type:Enzyme Catalytic Domain
Mol. Mass.:38220.43
Organism:MOUSE
Description:P47936
Residue:347
BDBM50432712
NameBDBM50432712
Synonyms:AM4089 | CHEMBL2348473
TypeSmall organic molecule
Emp. Form.C26H30O3
Mol. Mass.390.5146
SMILESCC1(C)Oc2cc(cc(O)c2-c2cc(CO)ccc12)C12CC3CC(CC(C3)C1)C2