Reaction Details
TargetCannabinoid receptor 1
LigandBDBM50432724
Substrate/Competitorn/a
Meas. Tech.ChEMBL_952585 (CHEMBL2354098)
Ki 31±n/a nM
Citation Thakur, GABajaj, SParonis, CPeng, YBowman, ALBarak, LSCaron, MGParrish, DDeschamps, JRMakriyannis, A Novel adamantyl cannabinoids as CB1 receptor probes. J Med Chem56:3904-21 (2013) 
 
Cannabinoid receptor 1
Name:Cannabinoid receptor 1
Type:G Protein-Coupled Receptor (GPCR)
Mol. Mass.:52856.55
Organism:Rattus norvegicus (rat)
Description:P20272
Residue:473
BDBM50432724
NameBDBM50432724
Synonyms:CHEMBL2348465
TypeSmall organic molecule
Emp. Form.C28H38O3
Mol. Mass.422.5995
SMILESCO\C=C/[C@@H]1CC[C@@H]2[C@@H](C1)c1c(O)cc(cc1OC2(C)C)C12CC3CC(CC(C3)C1)C2